Reaction Details
TargetAmyloid-beta precursor protein
LigandBDBM41537
Substrate/Competitorn/a
Meas. Tech.sAPPbeta Release Assay
IC50 0.140±n/a nM
Citation Csjernyik, GKarlstrom, SKers, AKolmodin, KNylof, MOhberg, LRakos, LSandberg, LSehgelmeble, FSoderman, PSwahn, BVon Berg, S Compounds and their use as BACE inhibitors US Patent US10231967 Publication Date 3/19/2019
 
Amyloid-beta precursor protein
Name:Amyloid-beta precursor protein
Type:Single-pass type I membrane protein
Mol. Mass.:86890.41
Organism:Homo sapiens (Human)
Description:P05067
Residue:770
BDBM41537
NameBDBM41537
Synonyms:US10231967, Example 114 US9918985, Example 114
Typen/a
Emp. Form.C26H28N4O
Mol. Mass.412.5267
SMILESCO[C@H]1CC[C@@]2(Cc3ccc(cc3[C@@]22N=C(C)C(N)=N2)-c2cncc(c2)C#CC)CC1