Reaction Details
TargetAngiotensin-converting enzyme 2
LigandBDBM21473
Substrate/CompetitorBDBM21453
Meas. Tech.Enzyme Inhibition Assay
pH6.8±n/a
Temperature298.15±n/a K
Ki 1.25±n/a nM
Citation Mores, AMatziari, MBeau, FCuniasse, PYiotakis, ADive, V Development of Potent and Selective Phosphinic Peptide Inhibitors of Angiotensin-Converting Enzyme 2. J Med Chem51:2216-2226 (2008) 
 
Angiotensin-converting enzyme 2
Name:Angiotensin-converting enzyme 2
Type:Enzyme
Mol. Mass.:92448.86
Organism:Homo sapiens (Human)
Description:n/a
Residue:805
BDBM21473
BDBM21453
NameBDBM21473
Synonyms:3-{[1-(2-acetamido-4-methylpentanoyl)pyrrolidin-2-yl](hydroxy)phosphoryl}-2-[(3-phenyl-1,2-oxazol-5-yl)methyl]propanoic acid The second fraction of the HPLC chromatogram.
TypeSmall organic molecule
Emp. Form.C25H34N3O7P
Mol. Mass.519.5271
SMILESCC(C)CC(NC(C)=O)C(=O)N1CCC=C1P(O)(O)CC(Cc1cc(no1)-c1ccccc1)C(O)=O