Reaction Details
TargetAngiotensin-converting enzyme 2
LigandBDBM21479
Substrate/CompetitorBDBM21453
Meas. Tech.Enzyme Inhibition Assay
pH6.5±n/a
Temperature295.15±n/a K
IC50 340±n/a nM
Citation Dales, NAGould, AEBrown, JACalderwood, EFGuan, BMinor, CAGavin, JMHales, PKaushik, VKStewart, MTummino, PJVickers, CSOcain, TDPatane, MA Substrate-based design of the first class of angiotensin-converting enzyme-related carboxypeptidase (ACE2) inhibitors. J Am Chem Soc124:11852-3 (2002) 
 
Angiotensin-converting enzyme 2
Name:Angiotensin-converting enzyme 2
Type:Enzyme
Mol. Mass.:92448.86
Organism:Homo sapiens (Human)
Description:n/a
Residue:805
BDBM21479
BDBM21453
NameBDBM21479
Synonyms:(2S)-2-{[(1S)-2-(1-benzyl-1H-imidazol-5-yl)-1-carboxyethyl]amino}-3-phenylpropanoic acid | Amino dicarboxylate analogue, 5
TypeSmall organic molecule
Emp. Form.C22H23N3O4
Mol. Mass.393.4357
SMILESOC(=O)[C@H](Cc1cncn1Cc1ccccc1)N[C@@H](Cc1ccccc1)C(O)=O