Reaction Details
TargetCarboxypeptidase A1
LigandBDBM21487
Substrate/CompetitorBDBM21477
Meas. Tech.CPA Inhibition Assay
pH7.5±n/a
Temperature295.15±n/a K
IC50>10000±n/a nM
Citation Dales, NAGould, AEBrown, JACalderwood, EFGuan, BMinor, CAGavin, JMHales, PKaushik, VKStewart, MTummino, PJVickers, CSOcain, TDPatane, MA Substrate-based design of the first class of angiotensin-converting enzyme-related carboxypeptidase (ACE2) inhibitors. J Am Chem Soc124:11852-3 (2002) 
 
Carboxypeptidase A1
Name:Carboxypeptidase A1
Type:Enzyme
Mol. Mass.:47073.90
Organism:Bos taurus (bovine)
Description:From Sigma-Aldrich Co.
Residue:419
BDBM21487
BDBM21477
NameBDBM21487
Synonyms:(2S)-2-{[(1S)-1-carboxy-2-{1-[(3,4-dimethylphenyl)methyl]-1H-imidazol-5-yl}ethyl]amino}-4-methylpentanoic acid | Amino dicarboxylate analogue, 14
TypeSmall organic molecule
Emp. Form.C21H29N3O4
Mol. Mass.387.4727
SMILESCC(C)C[C@H](N[C@@H](Cc1cncn1Cc1ccc(C)c(C)c1)C(O)=O)C(O)=O