Reaction Details
TargetAngiotensin-converting enzyme
LigandBDBM21486
Substrate/CompetitorBDBM21490
Meas. Tech.Enzyme Inhibition Assay
pH7.5±n/a
Temperature295.15±n/a K
IC50>10000±n/a nM
Citation Dales, NAGould, AEBrown, JACalderwood, EFGuan, BMinor, CAGavin, JMHales, PKaushik, VKStewart, MTummino, PJVickers, CSOcain, TDPatane, MA Substrate-based design of the first class of angiotensin-converting enzyme-related carboxypeptidase (ACE2) inhibitors. J Am Chem Soc124:11852-3 (2002) 
 
Angiotensin-converting enzyme
Name:Angiotensin-converting enzyme
Type:Enzyme
Mol. Mass.:150545.88
Organism:Sus scrofa (pig)
Description:A1YQ85
Residue:1309
BDBM21486
BDBM21490
NameBDBM21486
Synonyms:(2S)-2-{[(1S)-1-carboxy-2-{1-[(3-methylphenyl)methyl]-1H-imidazol-5-yl}ethyl]amino}-4-methylpentanoic acid | Amino dicarboxylate analogue, 13
TypeSmall organic molecule
Emp. Form.C20H27N3O4
Mol. Mass.373.4461
SMILESCC(C)C[C@H](N[C@@H](Cc1cncn1Cc1cccc(C)c1)C(O)=O)C(O)=O