Reaction Details
TargetGalectin-7
LigandBDBM21526
Substrate/CompetitorBDBM21520
Meas. Tech.Fluorescence Polarization Assay
Kd 150000±n/a nM
Citation Salameh, BASundin, ALeffler, HNilsson, UJ Thioureido N-acetyllactosamine derivatives as potent galectin-7 and 9N inhibitors. Bioorg Med Chem14:1215-20 (2006) 
 
Galectin-7
Name:Galectin-7
Type:Galactoside-binding protein
Mol. Mass.:15077.89
Organism:Homo sapiens (Human)
Description:n/a
Residue:136
BDBM21526
BDBM21520
NameBDBM21526
Synonyms:N-[(2R,3R,4R,5S,6R)-5-{[(2S,3R,4S,5R,6R)-3,5-dihydroxy-6-(hydroxymethyl)-4-{[(3-hydroxypropyl)carbamothioyl]amino}oxan-2-yl]oxy}-4-hydroxy-6-(hydroxymethyl)-2-methoxyoxan-3-yl]acetamide | Thioureido N-acetyllactosamine derivative, 10
Typen/a
Emp. Form.C19H35N3O11S
Mol. Mass.513.56
SMILESCO[C@@H]1O[C@H](CO)[C@@H](O[C@@H]2O[C@H](CO)[C@H](O)[C@H](NC(=S)NCCCO)[C@H]2O)[C@H](O)[C@H]1NC(C)=O