Reaction Details
TargetGalectin-8
LigandBDBM21527
Substrate/CompetitorBDBM21520
Meas. Tech.Fluorescence Polarization Assay
Kd>3000000±n/a nM
Citation Salameh, BASundin, ALeffler, HNilsson, UJ Thioureido N-acetyllactosamine derivatives as potent galectin-7 and 9N inhibitors. Bioorg Med Chem14:1215-20 (2006) 
 
Galectin-8
Name:Galectin-8
Type:PROTEIN
Mol. Mass.:35814.23
Organism:Homo sapiens (Human)
Description:ChEMBL_1454625
Residue:317
BDBM21527
BDBM21520
NameBDBM21527
Synonyms:N-[(2R,3R,4R,5S,6R)-5-{[(2S,3R,4S,5R,6R)-3,5-dihydroxy-6-(hydroxymethyl)-4-[(phenylcarbamothioyl)amino]oxan-2-yl]oxy}-4-hydroxy-6-(hydroxymethyl)-2-methoxyoxan-3-yl]acetamide | Thioureido N-acetyllactosamine derivative, 11
Typen/a
Emp. Form.C22H33N3O10S
Mol. Mass.531.577
SMILESCO[C@@H]1O[C@H](CO)[C@@H](O[C@@H]2O[C@H](CO)[C@H](O)[C@H](NC(=S)Nc3ccccc3)[C@H]2O)[C@H](O)[C@H]1NC(C)=O