Reaction Details
TargetProstaglandin D2 receptor 2
LigandBDBM21589
Substrate/CompetitorBDBM21544
Meas. Tech.Radioligand Binding Assay and [35S] GTP-gamma-S Binding Assay
Ki 438±n/a nM
Citation Crosignani, SPage, PMissotten, MColovray, VCleva, CArrighi, JFAtherall, JMacritchie, JMartin, THumbert, YGaudet, MPupowicz, DMaio, MPittet, PAGolzio, LGiachetti, CRocha, CBernardinelli, GFilinchuk, YScheer, ASchwarz, MKChollet, A Discovery of a New Class of Potent, Selective, and Orally Bioavailable CRTH2 (DP2) Receptor Antagonists for the Treatment of Allergic Inflammatory Diseases. J Med Chem51:2227-2243 (2008) 
 
Prostaglandin D2 receptor 2
Name:Prostaglandin D2 receptor 2
Type:Enzyme
Mol. Mass.:43295.45
Organism:Homo sapiens (Human)
Description:Q9Y5Y4
Residue:395
BDBM21589
BDBM21544
NameBDBM21589
Synonyms:2-[5-chloro-1'-(1,3-oxazol-2-ylmethyl)-1,2-dihydrospiro[indole-3,3'-pyrrolidine]-2,2',5'-trione]acetic acid | Spiro-indolinone analogue, 81
TypeSmall organic molecule
Emp. Form.C17H12ClN3O6
Mol. Mass.389.747
SMILESOC(=O)CN1C(=O)C2(CC(=O)N(Cc3ncco3)C2=O)c2cc(Cl)ccc12