Reaction Details
TargetProstaglandin D2 receptor 2
LigandBDBM21593
Substrate/CompetitorBDBM21544
Meas. Tech.Radioligand Binding Assay
Ki 51±n/a nM
EC50 220±n/a nM
Citation Crosignani, SPage, PMissotten, MColovray, VCleva, CArrighi, JFAtherall, JMacritchie, JMartin, THumbert, YGaudet, MPupowicz, DMaio, MPittet, PAGolzio, LGiachetti, CRocha, CBernardinelli, GFilinchuk, YScheer, ASchwarz, MKChollet, A Discovery of a New Class of Potent, Selective, and Orally Bioavailable CRTH2 (DP2) Receptor Antagonists for the Treatment of Allergic Inflammatory Diseases. J Med Chem51:2227-2243 (2008) 
 
Prostaglandin D2 receptor 2
Name:Prostaglandin D2 receptor 2
Type:Enzyme
Mol. Mass.:43295.45
Organism:Homo sapiens (Human)
Description:Q9Y5Y4
Residue:395
BDBM21593
BDBM21544
NameBDBM21593
Synonyms:2-{5-chloro-1'-[(3,5-dimethyl-1,2-oxazol-4-yl)methyl]-1,2-dihydrospiro[indole-3,3'-pyrrolidine]-2,2',5'-trione}acetic acid | Spiro-indolinone analogue, 85
TypeSmall organic molecule
Emp. Form.C19H16ClN3O6
Mol. Mass.417.8
SMILESCc1noc(C)c1CN1C(=O)CC2(C1=O)C(=O)N(CC(O)=O)c1ccc(Cl)cc21