Reaction Details
TargetLysine-specific histone demethylase 1A
LigandBDBM261741
Substrate/Competitorn/a
Meas. Tech.Monoamine Oxidase Assays for Determining the Selectivity of the Compounds of the Invention for LSD1
Ki 50±n/a nM
Citation Ortega Muñoz, AFyfe, MCMartinell Pedemonte, MTirapu Fernandez De La Cuesta, IEstiarte Martinez, M Arylcyclopropylamine based demethylase inhibitors of LSD1 and their medical use US Patent US10233178 Publication Date 3/19/2019
 
Lysine-specific histone demethylase 1A
Name:Lysine-specific histone demethylase 1A
Type:Enzyme
Mol. Mass.:92901.01
Organism:Homo sapiens (Human)
Description:O60341
Residue:852
BDBM261741
NameBDBM261741
Synonyms:US10233178, Example 1 | US9708309, 1
TypeSmall organic molecule
Emp. Form.C21H22N4O
Mol. Mass.346.4256
SMILESNc1ncc(CN[C@H]2C[C@@H]2c2ccc(OCc3ccccc3)cc2)cn1