Reaction Details
TargetHematopoietic prostaglandin D synthase
LigandBDBM21617
Substrate/CompetitorBDBM21614
Meas. Tech.In Vitro GST Activity Assay
pH7.2±n/a
Temperature295.15±n/a K
IC50 33000±n/a nM
Citation Hohwy, MSpadola, LLundquist, BHawtin, PDahmén, JGroth-Clausen, INilsson, EPersdotter, Svon Wachenfeldt, KFolmer, RHEdman, K Novel prostaglandin d synthase inhibitors generated by fragment-based drug design. J Med Chem51:2178-86 (2008) 
 
Hematopoietic prostaglandin D synthase
Name:Hematopoietic prostaglandin D synthase
Type:Enzyme
Mol. Mass.:23341.07
Organism:Homo sapiens (Human)
Description:The protein was expressed in E. coli strain BL21(DE3) with an N-terminal 6-His tag.
Residue:199
BDBM21617
BDBM21614
NameBDBM21617
Synonyms:4-(3,4-dimethoxyphenyl)-1-phenyl-1H-pyrazol-5-amine | Pyrazol-5-amine, 5
TypeSmall organic molecule
Emp. Form.C17H17N3O2
Mol. Mass.295.3358
SMILESCOc1ccc(cc1OC)-c1cnn(c1N)-c1ccccc1