Reaction Details
TargetHematopoietic prostaglandin D synthase
LigandBDBM21619
Substrate/CompetitorBDBM21614
Meas. Tech.In Vitro GST Activity Assay
pH7.2±n/a
Temperature295.15±n/a K
IC50 45000±n/a nM
Citation Hohwy, MSpadola, LLundquist, BHawtin, PDahmén, JGroth-Clausen, INilsson, EPersdotter, Svon Wachenfeldt, KFolmer, RHEdman, K Novel prostaglandin d synthase inhibitors generated by fragment-based drug design. J Med Chem51:2178-86 (2008) 
 
Hematopoietic prostaglandin D synthase
Name:Hematopoietic prostaglandin D synthase
Type:Enzyme
Mol. Mass.:23341.07
Organism:Homo sapiens (Human)
Description:The protein was expressed in E. coli strain BL21(DE3) with an N-terminal 6-His tag.
Residue:199
BDBM21619
BDBM21614
NameBDBM21619
Synonyms:Phenylpyridazine-3-carboxylate, 7 | ethyl 5-methoxy-6-phenylpyridazine-3-carboxylate
TypeSmall organic molecule
Emp. Form.C14H14N2O3
Mol. Mass.258.2726
SMILESCCOC(=O)c1cc(OC)c(nn1)-c1ccccc1