Reaction Details
TargetHematopoietic prostaglandin D synthase
LigandBDBM21625
Substrate/CompetitorBDBM21614
Meas. Tech.In Vitro GST Activity Assay
pH7.2±n/a
Temperature295.15±n/a K
IC50 21±n/a nM
Citation Hohwy, MSpadola, LLundquist, BHawtin, PDahmén, JGroth-Clausen, INilsson, EPersdotter, Svon Wachenfeldt, KFolmer, RHEdman, K Novel prostaglandin d synthase inhibitors generated by fragment-based drug design. J Med Chem51:2178-86 (2008) 
 
Hematopoietic prostaglandin D synthase
Name:Hematopoietic prostaglandin D synthase
Type:Enzyme
Mol. Mass.:23341.07
Organism:Homo sapiens (Human)
Description:The protein was expressed in E. coli strain BL21(DE3) with an N-terminal 6-His tag.
Residue:199
BDBM21625
BDBM21614
NameBDBM21625
Synonyms:2-phenyl-5-(1H-pyrazol-3-yl)-1,3-thiazole Pyrazolylthiazole, 13
TypeSmall organic molecule
Emp. Form.C12H9N3S
Mol. Mass.227.285
SMILESc1cc(n[nH]1)-c1cnc(s1)-c1ccccc1