Reaction Details
TargetNeprilysin
LigandBDBM21637
Substrate/CompetitorBDBM21631
Meas. Tech.In Vitro Inhibition of NEP
pH7.4±n/a
Temperature310.15±n/a K
Ki 5.4±0.1 nM
Km37000±n/a nM
Citation Inguimbert, NCoric, PPoras, HMeudal, HTeffot, FFournié-Zaluski, MCRoques, BP Toward an optimal joint recognition of the S1' subsites of endothelin converting enzyme-1 (ECE-1), angiotensin converting enzyme (ACE), and neutral endopeptidase (NEP). J Med Chem45:1477-86 (2002) 
 
Neprilysin
Name:Neprilysin
Type:Enzyme
Mol. Mass.:85570.75
Organism:Oryctolagus cuniculus (rabbit)
Description:NEP was purified to homogeneity from rabbit kidney.
Residue:750
BDBM21637
BDBM21631
NameBDBM21637
Synonyms:(2S)-3-(1H-indol-3-yl)-2-[3-(naphthalen-2-yl)-2-(sulfanylmethyl)butanamido]propanoic acid | Mercaptoacyl amino acid compound, (rac)-11
TypeSmall organic molecule
Emp. Form.C26H26N2O3S
Mol. Mass.446.561
SMILESCC(C(CS)C(=O)N[C@@H](Cc1c[nH]c2ccccc12)C(O)=O)c1ccc2ccccc2c1