Reaction Details
TargetNeprilysin
LigandBDBM21651
Substrate/CompetitorBDBM21631
Meas. Tech.In Vitro Inhibition of NEP
pH7.4±n/a
Temperature310.15±n/a K
Ki 5.0±0.4 nM
Km37000±n/a nM
Citation Inguimbert, NCoric, PPoras, HMeudal, HTeffot, FFournié-Zaluski, MCRoques, BP Toward an optimal joint recognition of the S1' subsites of endothelin converting enzyme-1 (ECE-1), angiotensin converting enzyme (ACE), and neutral endopeptidase (NEP). J Med Chem45:1477-86 (2002) 
 
Neprilysin
Name:Neprilysin
Type:Enzyme
Mol. Mass.:85570.75
Organism:Oryctolagus cuniculus (rabbit)
Description:NEP was purified to homogeneity from rabbit kidney.
Residue:750
BDBM21651
BDBM21631
NameBDBM21651
Synonyms:(2S)-3-(1H-indol-3-yl)-2-[(2R,3S)-3-(4-phenylphenyl)-2-(sulfanylmethyl)butanamido]propanoic acid | Mercaptoacyl amino acid compound, 10d
TypeSmall organic molecule
Emp. Form.C28H28N2O3S
Mol. Mass.472.599
SMILESC[C@@H]([C@@H](CS)C(=O)N[C@@H](Cc1c[nH]c2ccccc12)C(O)=O)c1ccc(cc1)-c1ccccc1