Reaction Details
TargetNeprilysin
LigandBDBM21656
Substrate/CompetitorBDBM21631
Meas. Tech.In Vitro Inhibition of NEP
pH7.4±n/a
Temperature310.15±n/a K
Ki 8.0±0.6 nM
Km37000±n/a nM
Citation Inguimbert, NCoric, PPoras, HMeudal, HTeffot, FFournié-Zaluski, MCRoques, BP Toward an optimal joint recognition of the S1' subsites of endothelin converting enzyme-1 (ECE-1), angiotensin converting enzyme (ACE), and neutral endopeptidase (NEP). J Med Chem45:1477-86 (2002) 
 
Neprilysin
Name:Neprilysin
Type:Enzyme
Mol. Mass.:85570.75
Organism:Oryctolagus cuniculus (rabbit)
Description:NEP was purified to homogeneity from rabbit kidney.
Residue:750
BDBM21656
BDBM21631
NameBDBM21656
Synonyms:(2S)-3-(1H-indol-3-yl)-2-[(2S)-3-sulfanyl-2-[(1S)-1,2,3,4-tetrahydronaphthalen-1-yl]propanamido]propanoic acid | Mercaptoacyl amino acid compound, 14a
TypeSmall organic molecule
Emp. Form.C24H26N2O3S
Mol. Mass.422.54
SMILESOC(=O)[C@H](Cc1c[nH]c2ccccc12)NC(=O)[C@@H](CS)[C@@H]1CCCc2ccccc12