Reaction Details
TargetEndothelin-converting enzyme 1
LigandBDBM21643
Substrate/CompetitorBDBM21661
Meas. Tech.In Vitro Inhibition of NEP
Ki 10.8±n/a nM
Citation Inguimbert, NCoric, PPoras, HMeudal, HTeffot, FFournié-Zaluski, MCRoques, BP Toward an optimal joint recognition of the S1' subsites of endothelin converting enzyme-1 (ECE-1), angiotensin converting enzyme (ACE), and neutral endopeptidase (NEP). J Med Chem45:1477-86 (2002) 
 
Endothelin-converting enzyme 1
Name:Endothelin-converting enzyme 1
Type:Enzyme
Mol. Mass.:87155.11
Organism:Homo sapiens (Human)
Description:P42892
Residue:770
BDBM21643
BDBM21661
NameBDBM21643
Synonyms:CGS-31,447 | [3-(naphthalen-1-yl)-1-{[(1S)-2-(4-phenylphenyl)-1-(1H-1,2,3,4-tetrazol-5-yl)ethyl]amino}propyl]phosphonic acid
TypeSmall organic molecule
Emp. Form.C28H28N5O3P
Mol. Mass.513.5274
SMILESOP(O)(=O)C(CCc1cccc2ccccc12)N[C@@H](Cc1ccc(cc1)-c1ccccc1)c1nnn[nH]1