Reaction Details
TargetCyclin-dependent kinase 6/G1/S-specific cyclin-D1
LigandBDBM370121
Substrate/Competitorn/a
Meas. Tech.CDK6/Cyclin D1 Mobility Shift Assay
Ki 0.080±n/a nM
Citation Freeman-Cook, KDHoffman, RLNagata, ANinkovic, S CDK2/4/6 inhibitors US Patent US10233188 Publication Date 3/19/2019
 
Cyclin-dependent kinase 6/G1/S-specific cyclin-D1
Name:Cyclin-dependent kinase 6/G1/S-specific cyclin-D1
Synonyms:CDK6/Cyclin D1
Type:Enzyme
Mol. Mass.:n/a
Description:n/a
Components:This complex has 2 components.
Component 1
Name:Cyclin-dependent kinase 6
Type:Enzyme Subunit
Mol. Mass.:36937.42
Organism:Homo sapiens (Human)
Description:Q00534
Residue:326
Component 2
Name:G1/S-specific cyclin-D1
Synonyms:CCND1_MOUSE Cyclin D1 | Cyl-1
Type:Enzyme Subunit
Mol. Mass.:33418.84
Organism:Mus musculus (mouse)
Description:n/a
Residue:295
BDBM370121
NameBDBM370121
Synonyms:6-(difluoromethyl)-8-[(1R,2R)-2-hydroxy-2-methylcyclopentyl]-2-{[1-(methylsulfonyl)piperidin-4-yl]amino}pyrido[2,3-d]pyrimidin-7(8H)-one US10800783, Example 10 | US11396512, Example 10
TypeSmall organic molecule
Emp. Form.C20H27F2N5O4S
Mol. Mass.471.521
SMILESC[C@@]1(O)CCC[C@H]1n1c2nc(NC3CCN(CC3)S(C)(=O)=O)ncc2cc(C(F)F)c1=O