Reaction Details
TargetCyclin-dependent kinase 2/G1/S-specific cyclin-E1
LigandBDBM370225
Substrate/Competitorn/a
Meas. Tech.CDK2/Cyclin E1 Mobility Shift Assay
Ki 0.120±n/a nM
Citation Freeman-Cook, KDHoffman, RLNagata, ANinkovic, S CDK2/4/6 inhibitors US Patent US10233188 Publication Date 3/19/2019
 
Cyclin-dependent kinase 2/G1/S-specific cyclin-E1
Name:Cyclin-dependent kinase 2/G1/S-specific cyclin-E1
Type:Protein
Mol. Mass.:n/a
Description:n/a
Components:This complex has 2 components.
Component 1
Name:Cyclin-dependent kinase 2
Synonyms:CDK2 CDK2_HUMAN Cell division protein kinase 2 Protein cereblon/Cyclin-dependent kinase 2 | p33 protein kinase
Type:Enzyme Subunit
Mol. Mass.:33938.17
Organism:Homo sapiens (Human)
Description:P24941
Residue:298
Component 2
Name:G1/S-specific cyclin-E1
Synonyms:CCNE CCNE1_HUMAN
Type:Enzyme Subunit
Mol. Mass.:47073.17
Organism:Homo sapiens (Human)
Description:n/a
Residue:410
BDBM370225
NameBDBM370225
Synonyms:US10233188, Example 112 US11396512, Example 112
TypeSmall organic molecule
Emp. Form.C22H31N5O4S
Mol. Mass.461.578
SMILESCc1cc2cnc(NC3CCN(CC3)S(=O)(=O)C3CC3)nc2n([C@@H]2CCC[C@@]2(C)O)c1=O