Reaction Details
TargetNuclear receptor subfamily 1 group I member 2
LigandBDBM21663
Substrate/CompetitorBDBM21662
Meas. Tech.Competition Ligand Binding Assay and Transient Transfection Assay
pH8±n/a
Temperature295.15±n/a K
IC50 10000±n/a nM
EC50 1000±n/a nM
Citation Xue, YChao, EZuercher, WJWillson, TMCollins, JLRedinbo, MR Crystal structure of the PXR-T1317 complex provides a scaffold to examine the potential for receptor antagonism. Bioorg Med Chem15:2156-66 (2007) 
 
Nuclear receptor subfamily 1 group I member 2
Name:Nuclear receptor subfamily 1 group I member 2
Type:Nuclear receptor
Mol. Mass.:49774.77
Organism:Homo sapiens (Human)
Description:O75469
Residue:434
BDBM21663
BDBM21662
NameBDBM21663
Synonyms:N-[4-(2,2,2-trifluoro-1-hydroxyethyl)phenyl]-N-(2,2,2-trifluoroethyl)benzenesulfonamide | T0901317 analogue, 2
TypeSmall organic molecule
Emp. Form.C16H13F6NO3S
Mol. Mass.413.335
SMILESOC(c1ccc(cc1)N(CC(F)(F)F)S(=O)(=O)c1ccccc1)C(F)(F)F