Reaction Details
TargetBile acid receptor
LigandBDBM21711
Substrate/CompetitorBDBM10852
Meas. Tech.Cotransfection Assay
pH7.2±n/a
Temperature310.15±n/a K
EC50 35100±n/a nM
Citation Kainuma, MMakishima, MHashimoto, YMiyachi, H Design, synthesis, and evaluation of non-steroidal farnesoid X receptor (FXR) antagonist. Bioorg Med Chem15:2587-600 (2007) 
 
Bile acid receptor
Name:Bile acid receptor
Type:Nuclear Receptor
Mol. Mass.:55916.24
Organism:Homo sapiens (Human)
Description:Q96RI1
Residue:486
BDBM21711
BDBM10852
NameBDBM21711
Synonyms:Isoxazole derivative, 11b | N,N-dibenzyl-3-[(E)-2-(2-chloro-4-{[3-(2,6-dichlorophenyl)-5-(propan-2-yl)-1,2-oxazol-4-yl]methoxy}phenyl)ethenyl]benzamide
TypeSmall organic molecule
Emp. Form.C42H35Cl3N2O3
Mol. Mass.722.098
SMILESCC(C)c1onc(c1COc1ccc(\C=C\c2cccc(c2)C(=O)N(Cc2ccccc2)Cc2ccccc2)c(Cl)c1)-c1c(Cl)cccc1Cl