Reaction Details
TargetBile acid receptor
LigandBDBM21714
Substrate/CompetitorBDBM10852
Meas. Tech.Cotransfection Assay
pH7.2±n/a
Temperature310.15±n/a K
EC50 2100±n/a nM
Citation Kainuma, MMakishima, MHashimoto, YMiyachi, H Design, synthesis, and evaluation of non-steroidal farnesoid X receptor (FXR) antagonist. Bioorg Med Chem15:2587-600 (2007) 
 
Bile acid receptor
Name:Bile acid receptor
Type:Nuclear Receptor
Mol. Mass.:55916.24
Organism:Homo sapiens (Human)
Description:Q96RI1
Residue:486
BDBM21714
BDBM10852
NameBDBM21714
Synonyms:3-[(2-chloro-4-{[3-(2,6-dichlorophenyl)-5-(propan-2-yl)-1,2-oxazol-4-yl]methoxy}benzene)(propyl)amido]benzoic acid | Isoxazole derivative, 15c
TypeSmall organic molecule
Emp. Form.C30H27Cl3N2O5
Mol. Mass.601.905
SMILESCCCN(C(=O)c1ccc(OCc2c(onc2-c2c(Cl)cccc2Cl)C(C)C)cc1Cl)c1cccc(c1)C(O)=O