Reaction Details
TargetBile acid receptor
LigandBDBM21716
Substrate/CompetitorBDBM10852
Meas. Tech.Cotransfection Assay
pH7.2±n/a
Temperature310.15±n/a K
EC50 840±n/a nM
Citation Kainuma, MMakishima, MHashimoto, YMiyachi, H Design, synthesis, and evaluation of non-steroidal farnesoid X receptor (FXR) antagonist. Bioorg Med Chem15:2587-600 (2007) 
 
Bile acid receptor
Name:Bile acid receptor
Type:Nuclear Receptor
Mol. Mass.:55916.24
Organism:Homo sapiens (Human)
Description:Q96RI1
Residue:486
BDBM21716
BDBM10852
NameBDBM21716
Synonyms:3-[(2-chloro-4-{[3-(2,6-dichlorophenyl)-5-(propan-2-yl)-1,2-oxazol-4-yl]methoxy}benzene)(2-phenylethyl)amido]benzoic acid | Isoxazole derivative, 15e
TypeSmall organic molecule
Emp. Form.C35H29Cl3N2O5
Mol. Mass.663.974
SMILESCC(C)c1onc(c1COc1ccc(C(=O)N(CCc2ccccc2)c2cccc(c2)C(O)=O)c(Cl)c1)-c1c(Cl)cccc1Cl