Reaction Details
TargetBile acid receptor
LigandBDBM21718
Substrate/CompetitorBDBM10852
Meas. Tech.Cotransfection Assay
pH7.2±n/a
Temperature310.15±n/a K
EC50 15800±n/a nM
CommentsAntagonist activity.
Citation Kainuma, MMakishima, MHashimoto, YMiyachi, H Design, synthesis, and evaluation of non-steroidal farnesoid X receptor (FXR) antagonist. Bioorg Med Chem15:2587-600 (2007) 
 
Bile acid receptor
Name:Bile acid receptor
Type:Nuclear Receptor
Mol. Mass.:55916.24
Organism:Homo sapiens (Human)
Description:Q96RI1
Residue:486
BDBM21718
BDBM10852
NameBDBM21718
Synonyms:3-[(E)-2-(2-chloro-4-{[3-(2,6-dichlorophenyl)-5-phenyl-1,2-oxazol-4-yl]methoxy}phenyl)ethenyl]benzoic acid | Isoxazole derivative, 10e
TypeSmall organic molecule
Emp. Form.C31H20Cl3NO4
Mol. Mass.576.854
SMILESOC(=O)c1cccc(\C=C\c2ccc(OCc3c(noc3-c3ccccc3)-c3c(Cl)cccc3Cl)cc2Cl)c1