Reaction Details
TargetBile acid receptor
LigandBDBM21723
Substrate/CompetitorBDBM10852
Meas. Tech.Cotransfection Assay
pH7.2±n/a
Temperature310.15±n/a K
EC50 3700±n/a nM
CommentsAntagonist activity.
Citation Kainuma, MMakishima, MHashimoto, YMiyachi, H Design, synthesis, and evaluation of non-steroidal farnesoid X receptor (FXR) antagonist. Bioorg Med Chem15:2587-600 (2007) 
 
Bile acid receptor
Name:Bile acid receptor
Type:Nuclear Receptor
Mol. Mass.:55916.24
Organism:Homo sapiens (Human)
Description:Q96RI1
Residue:486
BDBM21723
BDBM10852
NameBDBM21723
Synonyms:3-[(2-chloro-4-{[3-(2,6-dichlorophenyl)-5-(4-phenylphenyl)-1,2-oxazol-4-yl]methoxy}benzene)amido]benzoic acid | Isoxazole derivative, 15h
TypeSmall organic molecule
Emp. Form.C36H23Cl3N2O5
Mol. Mass.669.937
SMILESOC(=O)c1cccc(NC(=O)c2ccc(OCc3c(noc3-c3ccc(cc3)-c3ccccc3)-c3c(Cl)cccc3Cl)cc2Cl)c1