Reaction Details
TargetSuppressor of tumorigenicity 14 protein
LigandBDBM21745
Substrate/CompetitorBDBM21738
Meas. Tech.Enzyme Inhibition Assay
pH8.5±n/a
Temperature295.15±n/a K
Ki 2330±n/a nM
Citation Li, PJiang, SLee, SLLin, CYJohnson, MDDickson, RBMichejda, CJRoller, PP Design and synthesis of novel and potent inhibitors of the type II transmembrane serine protease, matriptase, based upon the sunflower trypsin inhibitor-1. J Med Chem50:5976-83 (2007) 
 
Suppressor of tumorigenicity 14 protein
Name:Suppressor of tumorigenicity 14 protein
Type:Single-pass type II membrane protein
Mol. Mass.:94769.23
Organism:Homo sapiens (Human)
Description:Q9Y5Y6
Residue:855
BDBM21745
BDBM21738
NameBDBM21745
Synonyms:2-[(1R,4S,7S,13S,19S,22S,25S,28S,31R,34S,40S,43S,49S)-25-(4-aminobutyl)-49-benzyl-19-[(2S)-butan-2-yl]-34-(3-carbamimidamidopropyl)-4-(2-carbamoylethyl)-28-[(1R)-1-hydroxyethyl]-22-(hydroxymethyl)-3,6,12,18,21,24,27,30,33,36,39,42,48,51-tetradecaoxo-53,54-dithia-2,5,11,17,20,23,26,29,32,35,38,41,47,50-tetradecaazapentacyclo[29.20.4.0^{7,11}.0^{13,17}.0^{43,47}]pentapentacontan-40-yl]acetic acid | Sunflower trypsin inhibitor-1(SFTI-1) analogue, 8
Typebicyclic peptide
Emp. Form.C66H101N19O19S2
Mol. Mass.1528.754
SMILES[#6]-[#6]-[#6@H](-[#6])-[#6@@H]-1-[#7]-[#6](=O)-[#6@H](-[#6]-[#8])-[#7]-[#6](=O)-[#6@H](-[#6]-[#6]-[#6]-[#6]-[#7])-[#7]-[#6](=O)-[#6@@H](-[#7]-[#6](=O)-[#6@@H]-2-[#6]-[#16]-[#16]-[#6]-[#6@H](-[#7]-[#6](=O)-[#6@H](-[#6]-[#6]-[#6](-[#7])=O)-[#7]-[#6](=O)-[#6@@H]-3-[#6]-[#6]-[#6]-[#7]-3-[#6](=O)-[#6@@H]-3-[#6]-[#6]-[#6]-[#7]-3-[#6]-1=O)-[#6](=O)-[#7]-[#6@@H](-[#6]-c1ccccc1)-[#6](=O)-[#7]-1-[#6]-[#6]-[#6]-[#6@H]-1-[#6](=O)-[#7]-[#6@@H](-[#6]-[#6](-[#8])=O)-[#6](=O)-[#7]-[#6]-[#6](=O)-[#7]-[#6@@H](-[#6]-[#6]-[#6]\[#7]=[#6](\[#7])-[#7])-[#6](=O)-[#7]-2)-[#6@@H](-[#6])-[#8]