Reaction Details
TargetDelta-type opioid receptor
LigandBDBM21845
Substrate/CompetitorBDBM21864
Meas. Tech.Radioligand Binding Assay
Ki>10000±n/a nM
Citation Mustazza, CBorioni, ASestili, ISbraccia, MRodomonte, ADel Giudice, MR Synthesis and pharmacological evaluation of 1,2-dihydrospiro[isoquinoline-4(3H),4'-piperidin]-3-ones as nociceptin receptor agonists. J Med Chem51:1058-62 (2008) 
 
Delta-type opioid receptor
Name:Delta-type opioid receptor
Type:G Protein-Coupled Receptor (GPCR)
Mol. Mass.:40382.98
Organism:Homo sapiens (Human)
Description:Competition binding assays were carried out using membrane preparations from transfected HN9.10 cells that constitutively expressed the delta opioid receptor.
Residue:372
BDBM21845
BDBM21864
NameBDBM21845
Synonyms:2-methyl-1'-[4-(propan-2-yl)cyclohexyl]-2,3-dihydro-1H-spiro[isoquinoline-4,4'-piperidine]-3-one | Piperidine Derivative, 5j
TypeSmall organic molecule
Emp. Form.C23H34N2O
Mol. Mass.354.5289
SMILESCC(C)C1CCC(CC1)N1CCC2(CC1)C(=O)N(C)Cc1ccccc21