Reaction Details
TargetKappa-type opioid receptor
LigandBDBM21846
Substrate/CompetitorBDBM21865
Meas. Tech.Radioligand Binding Assay
Ki 412±n/a nM
Citation Mustazza, CBorioni, ASestili, ISbraccia, MRodomonte, ADel Giudice, MR Synthesis and pharmacological evaluation of 1,2-dihydrospiro[isoquinoline-4(3H),4'-piperidin]-3-ones as nociceptin receptor agonists. J Med Chem51:1058-62 (2008) 
 
Kappa-type opioid receptor
Name:Kappa-type opioid receptor
Type:G Protein-Coupled Receptor (GPCR)
Mol. Mass.:42648.76
Organism:Homo sapiens (Human)
Description:P41145
Residue:380
BDBM21846
BDBM21865
NameBDBM21846
Synonyms:5-fluoro-2-methyl-1'-[4-(propan-2-yl)cyclohexyl]-2,3-dihydro-1H-spiro[isoquinoline-4,4'-piperidine]-3-one | Piperidine Derivative, 5k
TypeSmall organic molecule
Emp. Form.C23H33FN2O
Mol. Mass.372.5193
SMILESCC(C)C1CCC(CC1)N1CCC2(CC1)C(=O)N(C)Cc1cccc(F)c21