Reaction Details
TargetKappa-type opioid receptor
LigandBDBM21859
Substrate/CompetitorBDBM21865
Meas. Tech.Radioligand Binding Assay
Ki 3844±n/a nM
Citation Mustazza, CBorioni, ASestili, ISbraccia, MRodomonte, ADel Giudice, MR Synthesis and pharmacological evaluation of 1,2-dihydrospiro[isoquinoline-4(3H),4'-piperidin]-3-ones as nociceptin receptor agonists. J Med Chem51:1058-62 (2008) 
 
Kappa-type opioid receptor
Name:Kappa-type opioid receptor
Type:G Protein-Coupled Receptor (GPCR)
Mol. Mass.:42648.76
Organism:Homo sapiens (Human)
Description:P41145
Residue:380
BDBM21859
BDBM21865
NameBDBM21859
Synonyms:1'-(4-tert-butylcyclohexyl)-2,3-dihydro-1H-spiro[isoquinoline-4,4'-piperidine]-3-one | Piperidine Derivative, 6g
TypeSmall organic molecule
Emp. Form.C23H34N2O
Mol. Mass.354.5289
SMILESCC(C)(C)C1CCC(CC1)N1CCC2(CC1)C(=O)NCc1ccccc21