Reaction Details
TargetPhosphatidylinositol 4,5-bisphosphate 3-kinase catalytic subunit beta/delta isoform
LigandBDBM261159
Substrate/Competitorn/a
Meas. Tech.A2 PI3Kdelta Scintillation Proximity Assay
pH6.7±n/a
Temperature298.15±n/a K
IC50<10±n/a nM
Commentsextracted
Citation Li, YCombs, APYue, EWDouty, BMei, S Heterocyclylamines as PI3K inhibitors US Patent US9707233 Publication Date 7/18/2017
 
Phosphatidylinositol 4,5-bisphosphate 3-kinase catalytic subunit beta/delta isoform
Name:Phosphatidylinositol 4,5-bisphosphate 3-kinase catalytic subunit beta/delta isoform
Type:Protein
Mol. Mass.:n/a
Description:n/a
Components:This complex has 2 components.
Component 1
Name:Phosphatidylinositol 4,5-bisphosphate 3-kinase catalytic subunit delta isoform
Synonyms:PI3-kinase p110 subunit delta PI3-kinase subunit p110-delta PIK3CD Phosphatidylinositol 4,5-biphosphate 3-kinase catalytic subunit delta (PIK3CD) Phosphatidylinositol 4,5-bisphosphate 3-kinase 110 kDa catalytic subunit delta (PI3K delta) Phosphatidylinositol 4,5-bisphosphate 3-kinase catalytic subunit delta (PI3Kdelta) Phosphatidylinositol 4,5-bisphosphate 3-kinase catalytic subunit delta isoform (PI3K delta) Phosphatidylinositol 4,5-bisphosphate 3-kinase catalytic subunit delta isoform (PI3K-delta) Phosphatidylinositol 4,5-bisphosphate 3-kinase catalytic subunit delta isoform (PI3Kdelta)
Type:Enzyme Subunit
Mol. Mass.:119489.41
Organism:Homo sapiens (Human)
Description:O00329
Residue:1044
Component 2
Name:Phosphatidylinositol 4,5-bisphosphate 3-kinase catalytic subunit beta isoform
Synonyms:PI3-kinase p110 subunit beta PI3Kbeta PIK3CB Phosphatidylinositol 4,5-bisphosphate 3-kinase catalytic subunit beta (PI3Kbeta) Phosphatidylinositol 4,5-bisphosphate 3-kinase catalytic subunit beta isoform (PI3K) Phosphatidylinositol 4,5-bisphosphate 3-kinase catalytic subunit beta isoform (PI3Kbeta) Phosphatidylinositol-4,5-bisphosphate 3-kinase catalytic subunit beta isoform Phosphoinositide 3-Kinase (PI3K), beta Chain A PtdIns-3-kinase p110
Type:Enzyme Subunit
Mol. Mass.:122769.00
Organism:Homo sapiens (Human)
Description:P42338
Residue:1070
BDBM261159
NameBDBM261159
Synonyms:1-(1-{3-[1-(1-Acetylpiperidin-4-yl)-1H-pyrazol-4-yl]-5-chloro-2-methoxy-4-methylphenyl}ethyl)-3-methyl-1H-pyrazolo[3,4-d]pyrimidin-4-amine US10376513, Example 182 US11433071, Example 182 US9730939, Example 182
TypeSmall organic molecule
Emp. Form.C26H31ClN8O2
Mol. Mass.523.03
SMILESCOc1c(cc(Cl)c(C)c1-c1cnn(c1)C1CCN(CC1)C(C)=O)C(C)n1nc(C)c2c(N)ncnc12