Reaction Details
TargetHistone acetyltransferase KAT2B
LigandBDBM50234943
Substrate/Competitorn/a
Meas. Tech.PCAF AlphaLisa Binding Assay
IC50 85.0±n/a nM
Citation Albrecht, BKBurdick, DJCote, ADuplessis, MNasveschuk, CGTaylor, AM Therapeutic compounds and uses thereof US Patent US10239861 Publication Date 3/26/2019
 
Histone acetyltransferase KAT2B
Name:Histone acetyltransferase KAT2B
Type:PROTEIN
Mol. Mass.:93045.76
Organism:Homo sapiens (Human)
Description:ChEMBL_1502838
Residue:832
BDBM50234943
NameBDBM50234943
Synonyms:CHEMBL4099456 | US10239861, Example 3
TypeSmall organic molecule
Emp. Form.C11H17ClN4O
Mol. Mass.256.732
SMILESCN1CCCC(C1)Nc1cnn(C)c(=O)c1Cl