Reaction Details
TargetHistone acetyltransferase KAT2B
LigandBDBM371524
Substrate/Competitorn/a
Meas. Tech.PCAF AlphaLisa Binding Assay
IC50 187±n/a nM
Citation Albrecht, BKBurdick, DJCote, ADuplessis, MNasveschuk, CGTaylor, AM Therapeutic compounds and uses thereof US Patent US10239861 Publication Date 3/26/2019
 
Histone acetyltransferase KAT2B
Name:Histone acetyltransferase KAT2B
Type:PROTEIN
Mol. Mass.:93045.76
Organism:Homo sapiens (Human)
Description:ChEMBL_1502838
Residue:832
BDBM371524
NameBDBM371524
Synonyms:(racemic)-4-chloro-2-methyl-5-((1-methylazepan-4-yl)amino)pyridazin-3(2H)-one | US10239861, Example 4
TypeSmall organic molecule
Emp. Form.C12H19ClN4O
Mol. Mass.270.758
SMILESCN1CCCC(CC1)Nc1cnn(C)c(=O)c1Cl