Reaction Details
TargetHistone acetyltransferase KAT2B
LigandBDBM50234932
Substrate/Competitorn/a
Meas. Tech.PCAF AlphaLisa Binding Assay
IC50 12.7±n/a nM
Citation Albrecht, BKBurdick, DJCote, ADuplessis, MNasveschuk, CGTaylor, AM Therapeutic compounds and uses thereof US Patent US10239861 Publication Date 3/26/2019
 
Histone acetyltransferase KAT2B
Name:Histone acetyltransferase KAT2B
Type:PROTEIN
Mol. Mass.:93045.76
Organism:Homo sapiens (Human)
Description:ChEMBL_1502838
Residue:832
BDBM50234932
NameBDBM50234932
Synonyms:CHEMBL4103402 | US10239861, Example 20
TypeSmall organic molecule
Emp. Form.C15H25ClN4O
Mol. Mass.312.838
SMILESCC(C)C[C@H]1C[C@H](CN(C)C1)Nc1cnn(C)c(=O)c1Cl