Reaction Details
TargetHistone acetyltransferase KAT2B
LigandBDBM371542
Substrate/Competitorn/a
Meas. Tech.PCAF AlphaLisa Binding Assay
IC50 21.5±n/a nM
Citation Albrecht, BKBurdick, DJCote, ADuplessis, MNasveschuk, CGTaylor, AM Therapeutic compounds and uses thereof US Patent US10239861 Publication Date 3/26/2019
 
Histone acetyltransferase KAT2B
Name:Histone acetyltransferase KAT2B
Type:PROTEIN
Mol. Mass.:93045.76
Organism:Homo sapiens (Human)
Description:ChEMBL_1502838
Residue:832
BDBM371542
NameBDBM371542
Synonyms:4-chloro-5-(((3R,5S)-1,5-dimethylpiperidin-3-yl)amino)-2-methylpyridazin-3(2H)-one | US10239861, Example 22
TypeSmall organic molecule
Emp. Form.C12H19ClN4O
Mol. Mass.270.758
SMILESC[C@H]1C[C@H](CN(C)C1)Nc1cnn(C)c(=O)c1Cl