Reaction Details
TargetHistone acetyltransferase KAT2B
LigandBDBM371544
Substrate/Competitorn/a
Meas. Tech.PCAF AlphaLisa Binding Assay
IC50 167±n/a nM
Citation Albrecht, BKBurdick, DJCote, ADuplessis, MNasveschuk, CGTaylor, AM Therapeutic compounds and uses thereof US Patent US10239861 Publication Date 3/26/2019
 
Histone acetyltransferase KAT2B
Name:Histone acetyltransferase KAT2B
Type:PROTEIN
Mol. Mass.:93045.76
Organism:Homo sapiens (Human)
Description:ChEMBL_1502838
Residue:832
BDBM371544
NameBDBM371544
Synonyms:4-chloro-2-methyl-5-((1-methyl-5-phenylpiperidin-3-yl)amino)pyridazin-3(2H)-one | US10239861, Example 24
TypeSmall organic molecule
Emp. Form.C17H21ClN4O
Mol. Mass.332.828
SMILESCN1CC(CC(C1)c1ccccc1)Nc1cnn(C)c(=O)c1Cl