Reaction Details
TargetIndoleamine 2,3-dioxygenase 1
LigandBDBM21973
Substrate/CompetitorBDBM21974
Meas. Tech.Enzyme Inhibition Assay
pH6.5±n/a
Temperature310.15±n/a K
Ki 62000±7000 nM
Citation Carr, GChung, MKMauk, AGAndersen, RJ Synthesis of indoleamine 2,3-dioxygenase inhibitory analogues of the sponge alkaloid exiguamine a. J Med Chem51:2634-7 (2008) 
 
Indoleamine 2,3-dioxygenase 1
Name:Indoleamine 2,3-dioxygenase 1
Type:Enzyme
Mol. Mass.:45330.80
Organism:Homo sapiens (Human)
Description:P14902
Residue:403
BDBM21973
BDBM21974
NameBDBM21973
Synonyms:1-Methyltryptophan, 1 | 2-amino-3-(1-methyl-1H-indol-3-yl)propanoic acid
TypeSmall organic molecule
Emp. Form.C12H14N2O2
Mol. Mass.218.2518
SMILESCn1cc(CC(N)C(O)=O)c2ccccc12