Reaction Details
TargetMonocarboxylate transporter 1
LigandBDBM21990
Substrate/CompetitorBDBM21986
Meas. Tech.Radioligand Filter Binding Assay
pH7.8±n/a
Temperature295.15±n/a K
Ki 59±n/a nM
Citation Guile, SDBantick, JRCooper, MEDonald, DKEyssade, CIngall, AHLewis, RJMartin, BPMohammed, RTPotter, TJReynolds, RHSt-Gallay, SAWright, AD Optimization of monocarboxylate transporter 1 blockers through analysis and modulation of atropisomer interconversion properties. J Med Chem50:254-63 (2007) 
 
Monocarboxylate transporter 1
Name:Monocarboxylate transporter 1
Type:PROTEIN
Mol. Mass.:53956.64
Organism:Homo sapiens (Human)
Description:ChEMBL_1451367
Residue:500
BDBM21990
BDBM21986
NameBDBM21990
Synonyms:5-(azetidin-1-ylcarbonyl)-3-methyl-6-{[2-(methylamino)-1H-1,3-benzodiazol-1-yl]methyl}-1-(2-methylpropyl)-1H,2H,3H,4H-thieno[2,3-d]pyrimidine-2,4-dione | Thienopyrimidine-2,4-dione, 5
TypeSmall organic molecule
Emp. Form.C24H28N6O3S
Mol. Mass.480.583
SMILESCNc1nc2ccccc2n1Cc1sc2n(CC(C)C)c(=O)n(C)c(=O)c2c1C(=O)N1CCC1