Reaction Details
TargetMonocarboxylate transporter 1
LigandBDBM22002
Substrate/CompetitorBDBM21986
Meas. Tech.Radioligand Filter Binding Assay
pH7.8±n/a
Temperature295.15±n/a K
Ki 0.35±n/a nM
Citation Guile, SDBantick, JRCheshire, DRCooper, MEDavis, AMDonald, DKEvans, REyssade, CFerguson, DDHill, SHutchinson, RIngall, AHKingston, LPMartin, IMartin, BPMohammed, RTMurray, CPerry, MWReynolds, RHThorne, PVWilkinson, DJWithnall, J Potent blockers of the monocarboxylate transporter MCT1: novel immunomodulatory compounds. Bioorg Med Chem Lett16:2260-5 (2006) 
 
Monocarboxylate transporter 1
Name:Monocarboxylate transporter 1
Type:PROTEIN
Mol. Mass.:53956.64
Organism:Homo sapiens (Human)
Description:ChEMBL_1451367
Residue:500
BDBM22002
BDBM21986
NameBDBM22002
Synonyms:5-[(3-hydroxypropyl)sulfanyl]-3-methyl-1-(2-methylpropyl)-6-{[2-(trifluoromethyl)phenyl]methyl}-1H,2H,3H,4H-thieno[2,3-d]pyrimidine-2,4-dione | Thieno[2,3-d]pyrimidine-2,4(1H,3H)-dione, 4
TypeSmall organic molecule
Emp. Form.C22H25F3N2O3S2
Mol. Mass.486.571
SMILESCC(C)Cn1c2sc(Cc3ccccc3C(F)(F)F)c(SCCCO)c2c(=O)n(C)c1=O