Reaction Details
TargetMonocarboxylate transporter 1
LigandBDBM22027
Substrate/CompetitorBDBM22022
Meas. Tech.SPA Assay
pH7.4±n/a
Temperature295.15±n/a K
Ki 6.6±n/a nM
Citation Guile, SDBantick, JRCheshire, DRCooper, MEDavis, AMDonald, DKEvans, REyssade, CFerguson, DDHill, SHutchinson, RIngall, AHKingston, LPMartin, IMartin, BPMohammed, RTMurray, CPerry, MWReynolds, RHThorne, PVWilkinson, DJWithnall, J Potent blockers of the monocarboxylate transporter MCT1: novel immunomodulatory compounds. Bioorg Med Chem Lett16:2260-5 (2006) 
 
Monocarboxylate transporter 1
Name:Monocarboxylate transporter 1
Type:PROTEIN
Mol. Mass.:53956.64
Organism:Homo sapiens (Human)
Description:ChEMBL_1451367
Residue:500
BDBM22027
BDBM22022
NameBDBM22027
Synonyms:5-{[(3R)-3-hydroxypyrrolidin-1-yl]carbonyl}-3-methyl-6-{[2-(methylamino)-1H-1,3-benzodiazol-1-yl]methyl}-1-(2-methylpropyl)-1H,2H,3H,4H-thieno[2,3-d]pyrimidine-2,4-dione | Thieno[2,3-d]pyrimidine-2,4(1H,3H)-dione, 35
TypeSmall organic molecule
Emp. Form.C25H30N6O4S
Mol. Mass.510.608
SMILESCNc1nc2ccccc2n1Cc1sc2n(CC(C)C)c(=O)n(C)c(=O)c2c1C(=O)N1CC[C@@H](O)C1