Reaction Details
TargetMonocarboxylate transporter 1
LigandBDBM22028
Substrate/CompetitorBDBM22022
Meas. Tech.SPA Assay
pH7.4±n/a
Temperature295.15±n/a K
Ki 16±n/a nM
Citation Guile, SDBantick, JRCheshire, DRCooper, MEDavis, AMDonald, DKEvans, REyssade, CFerguson, DDHill, SHutchinson, RIngall, AHKingston, LPMartin, IMartin, BPMohammed, RTMurray, CPerry, MWReynolds, RHThorne, PVWilkinson, DJWithnall, J Potent blockers of the monocarboxylate transporter MCT1: novel immunomodulatory compounds. Bioorg Med Chem Lett16:2260-5 (2006) 
 
Monocarboxylate transporter 1
Name:Monocarboxylate transporter 1
Type:PROTEIN
Mol. Mass.:53956.64
Organism:Homo sapiens (Human)
Description:ChEMBL_1451367
Residue:500
BDBM22028
BDBM22022
NameBDBM22028
Synonyms:5-{[(3R)-3-hydroxypyrrolidin-1-yl]carbonyl}-3-methyl-6-[(2-methyl-1H-1,3-benzodiazol-1-yl)methyl]-1-(2-methylpropyl)-1H,2H,3H,4H-thieno[2,3-d]pyrimidine-2,4-dione | Thieno[2,3-d]pyrimidine-2,4(1H,3H)-dione, 36
TypeSmall organic molecule
Emp. Form.C25H29N5O4S
Mol. Mass.495.594
SMILESCC(C)Cn1c2sc(Cn3c(C)nc4ccccc34)c(C(=O)N3CC[C@@H](O)C3)c2c(=O)n(C)c1=O