Reaction Details
TargetMonocarboxylate transporter 1
LigandBDBM22029
Substrate/CompetitorBDBM22022
Meas. Tech.SPA Assay
pH7.4±n/a
Temperature295.15±n/a K
Ki 26±n/a nM
Citation Guile, SDBantick, JRCheshire, DRCooper, MEDavis, AMDonald, DKEvans, REyssade, CFerguson, DDHill, SHutchinson, RIngall, AHKingston, LPMartin, IMartin, BPMohammed, RTMurray, CPerry, MWReynolds, RHThorne, PVWilkinson, DJWithnall, J Potent blockers of the monocarboxylate transporter MCT1: novel immunomodulatory compounds. Bioorg Med Chem Lett16:2260-5 (2006) 
 
Monocarboxylate transporter 1
Name:Monocarboxylate transporter 1
Type:PROTEIN
Mol. Mass.:53956.64
Organism:Homo sapiens (Human)
Description:ChEMBL_1451367
Residue:500
BDBM22029
BDBM22022
NameBDBM22029
Synonyms:6-[(4,5-dichloro-2-methyl-1H-imidazol-1-yl)methyl]-5-{[(3R)-3-hydroxypyrrolidin-1-yl]carbonyl}-3-methyl-1-(2-methylpropyl)-1H,2H,3H,4H-thieno[2,3-d]pyrimidine-2,4-dione | Thieno[2,3-d]pyrimidine-2,4(1H,3H)-dione, 37
TypeSmall organic molecule
Emp. Form.C21H25Cl2N5O4S
Mol. Mass.514.425
SMILESCC(C)Cn1c2sc(Cn3c(C)nc(Cl)c3Cl)c(C(=O)N3CC[C@@H](O)C3)c2c(=O)n(C)c1=O