Reaction Details
TargetNitric oxide synthase, endothelial
LigandBDBM21961
Substrate/CompetitorBDBM21959
Meas. Tech.NOS Enzyme Inhibition Assay
pH7.5±n/a
Temperature303.15±n/a K
Ki 110000±n/a nM
Citation Flinspach, MLLi, HJamal, JYang, WHuang, HHah, JMGiómez-Vidal, JALitzinger, EASilverman, RBPoulos, TL Structural basis for dipeptide amide isoform-selective inhibition of neuronal nitric oxide synthase. Nat Struct Mol Biol11:54-9 (2004) 
 
Nitric oxide synthase, endothelial
Name:Nitric oxide synthase, endothelial
Type:Enzyme
Mol. Mass.:133292.26
Organism:Bos taurus (bovine)
Description:Recombinant eNOS overexpressed in E. coli was used in enzyme assays.
Residue:1205
BDBM21961
BDBM21959
NameBDBM21961
Synonyms:(2S,4R)-4-[(2S)-2-amino-5-(1-nitrocarbamimidamido)pentanamido]pyrrolidine-2-carboxamide JMC522060 Compound 3 | N omega-Nitro-L-Arginine-Containing Dipeptide, 2
Typen/a
Emp. Form.C11H22N8O4
Mol. Mass.330.3436
SMILESN[C@@H](CCCN=C(N)N[N+]([O-])=O)C(=O)N[C@H]1CN[C@@H](C1)C(N)=O