Reaction Details
TargetTranslocator protein
LigandBDBM22032
Substrate/CompetitorBDBM22032
Meas. Tech.Radioligand Binding Assay
pH7.4±n/a
Temperature277.15±n/a K
Ki 9.3±0.5 nM
Citation Taliani, SSimorini, FSergianni, VLa Motta, CDa Settimo, FCosimelli, BAbignente, EGreco, GNovellino, ERossi, LGremigni, VSpinetti, FChelli, BMartini, C New fluorescent 2-phenylindolglyoxylamide derivatives as probes targeting the peripheral-type benzodiazepine receptor: design, synthesis, and biological evaluation. J Med Chem50:404-7 (2007) 
 
Translocator protein
Name:Translocator protein
Type:Mitochondrion membrane protein
Mol. Mass.:18945.84
Organism:Rattus norvegicus (rat)
Description:Competitive binding experiments were performed on rat kidney mitochondrial membranes.
Residue:169
BDBM22032
BDBM22032
NameBDBM22032
Synonyms:1-(2-chlorophenyl)-N-methyl-N-(1-methylpropyl)isoquinoline-3-carboxamide N-(butan-2-yl)-1-(2-chlorophenyl)-N-methylisoquinoline-3-carboxamide PK-11195 RP 52028 | [3H]PK 11195
Typeradiolabeled ligand
Emp. Form.C21H21ClN2O
Mol. Mass.352.857
SMILESCCC(C)N(C)C(=O)c1cc2ccccc2c(n1)-c1ccccc1Cl