Reaction Details
TargetCathepsin B-like cysteine protease
LigandBDBM22049
Substrate/CompetitorBDBM22047
Meas. Tech.Enzyme Inhibition Assay
pH5.5±n/a
Temperature295.15±n/a K
IC50 8300±800 nM
Citation Mallari, JPShelat, AAObrien, TCaffrey, CRKosinski, AConnelly, MHarbut, MGreenbaum, DMcKerrow, JHGuy, RK Development of potent purine-derived nitrile inhibitors of the trypanosomal protease TbcatB. J Med Chem51:545-52 (2008) 
 
Cathepsin B-like cysteine protease
Name:Cathepsin B-like cysteine protease
Type:Enzyme
Mol. Mass.:37220.37
Organism:Trypanosoma brucei
Description:Enzyme was expressed in yeast Pichia pastoris.
Residue:340
BDBM22049
BDBM22047
NameBDBM22049
Synonyms:6-(cyclohexylamino)-9-propyl-9H-purine-2-carbonitrile | Compound 3{2,11}
TypeSmall organic molecule
Emp. Form.C15H20N6
Mol. Mass.284.3595
SMILESCCCn1cnc2c(NC3CCCCC3)nc(nc12)C#N