Reaction Details
TargetCathepsin B-like cysteine protease
LigandBDBM22073
Substrate/CompetitorBDBM22047
Meas. Tech.Enzyme Inhibition Assay
pH5.5±n/a
Temperature295.15±n/a K
IC50>25000±n/a nM
Citation Mallari, JPShelat, AAObrien, TCaffrey, CRKosinski, AConnelly, MHarbut, MGreenbaum, DMcKerrow, JHGuy, RK Development of potent purine-derived nitrile inhibitors of the trypanosomal protease TbcatB. J Med Chem51:545-52 (2008) 
 
Cathepsin B-like cysteine protease
Name:Cathepsin B-like cysteine protease
Type:Enzyme
Mol. Mass.:37220.37
Organism:Trypanosoma brucei
Description:Enzyme was expressed in yeast Pichia pastoris.
Residue:340
BDBM22073
BDBM22047
NameBDBM22073
Synonyms:9-benzyl-6-[(2-phenylethyl)amino]-9H-purine-2-carbonitrile | Compound 3{13,17}
TypeSmall organic molecule
Emp. Form.C21H18N6
Mol. Mass.354.4078
SMILESN#Cc1nc(NCCc2ccccc2)c2ncn(Cc3ccccc3)c2n1