Reaction Details
TargetCathepsin B-like cysteine protease
LigandBDBM22097
Substrate/CompetitorBDBM22047
Meas. Tech.Enzyme Inhibition Assay
Temperature298.15±n/a K
IC50 270±n/a nM
Commentsextracted
Citation Mallari, JPShelat, AAObrien, TCaffrey, CRKosinski, AConnelly, MHarbut, MGreenbaum, DMcKerrow, JHGuy, RK Development of potent purine-derived nitrile inhibitors of the trypanosomal protease TbcatB. J Med Chem51:545-52 (2008) 
 
Cathepsin B-like cysteine protease
Name:Cathepsin B-like cysteine protease
Type:Enzyme
Mol. Mass.:37220.37
Organism:Trypanosoma brucei
Description:Enzyme was expressed in yeast Pichia pastoris.
Residue:340
BDBM22097
BDBM22047
NameBDBM22097
Synonyms:6-{[(3,4-dichlorophenyl)methyl]amino}-9-(3-hydroxypropyl)-9H-purine-2-carbonitrile | Compound 3{12,2}
TypeSmall organic molecule
Emp. Form.C16H14Cl2N6O
Mol. Mass.377.228
SMILESOCCCn1cnc2c(NCc3ccc(Cl)c(Cl)c3)nc(nc12)C#N