Reaction Details
TargetSodium channel protein type 9 subunit alpha
LigandBDBM371652
Substrate/Competitorn/a
Meas. Tech.Rubidium efflux assay
IC50 1.000±n/a nM
Citation Ramdas, VLoriya, RMBanerjee, MPatil, PRJoshi, AADatrange, LSWalke, DSKhan, THDas, AKGote, GNKalhapure, VMPalle, VPKamboj, RK Sulfonamide compounds as voltage-gated sodium channel modulators US Patent US10239869 Publication Date 3/26/2019
 
Sodium channel protein type 9 subunit alpha
Name:Sodium channel protein type 9 subunit alpha
Type:Protein
Mol. Mass.:226375.97
Organism:Homo sapiens (Human)
Description:Q15858
Residue:1988
BDBM371652
NameBDBM371652
Synonyms:(R)-4-(2-(2-methyloxazol-4-yl)-4-(trifluoromethyl)phenyl)-N-(pyrimidin-4-yl)chroman-7-sulfonamide | US10239869, Example 78
TypeSmall organic molecule
Emp. Form.C24H19F3N4O4S
Mol. Mass.516.492
SMILESCc1nc(co1)-c1cc(ccc1[C@H]1CCOc2cc(ccc12)S(=O)(=O)Nc1ccncn1)C(F)(F)F