Reaction Details
TargetSodium channel protein type 9 subunit alpha
LigandBDBM371669
Substrate/Competitorn/a
Meas. Tech.Rubidium efflux assay
IC50 11.0±n/a nM
Citation Ramdas, VLoriya, RMBanerjee, MPatil, PRJoshi, AADatrange, LSWalke, DSKhan, THDas, AKGote, GNKalhapure, VMPalle, VPKamboj, RK Sulfonamide compounds as voltage-gated sodium channel modulators US Patent US10239869 Publication Date 3/26/2019
 
Sodium channel protein type 9 subunit alpha
Name:Sodium channel protein type 9 subunit alpha
Type:Protein
Mol. Mass.:226375.97
Organism:Homo sapiens (Human)
Description:Q15858
Residue:1988
BDBM371669
NameBDBM371669
Synonyms:N-(pyridazin-3-yl)-4-(2-(thiazol-2-yl)-4-(trifluoromethyl)phenyl)chroman-7-sulfonamide | US10239869, Example 95
TypeSmall organic molecule
Emp. Form.C23H17F3N4O3S2
Mol. Mass.518.531
SMILESFC(F)(F)c1ccc([C@H]2CCOc3cc(ccc23)S(=O)(=O)Nc2cccnn2)c(c1)-c1nccs1