Reaction Details
TargetSodium channel protein type 9 subunit alpha
LigandBDBM371736
Substrate/Competitorn/a
Meas. Tech.Rubidium efflux assay
IC50 0.700±n/a nM
Citation Ramdas, VLoriya, RMBanerjee, MPatil, PRJoshi, AADatrange, LSWalke, DSKhan, THDas, AKGote, GNKalhapure, VMPalle, VPKamboj, RK Sulfonamide compounds as voltage-gated sodium channel modulators US Patent US10239869 Publication Date 3/26/2019
 
Sodium channel protein type 9 subunit alpha
Name:Sodium channel protein type 9 subunit alpha
Type:Protein
Mol. Mass.:226375.97
Organism:Homo sapiens (Human)
Description:Q15858
Residue:1988
BDBM371736
NameBDBM371736
Synonyms:4-(2-(3-fluoropropyl)-4-(trifluoromethyl)phenyl)-N-(6-fluoropyridin-2-yl)chroman-7-sulfonamide | US10239869, Example 162
TypeSmall organic molecule
Emp. Form.C24H21F5N2O3S
Mol. Mass.512.492
SMILESFCCCc1cc(ccc1[C@H]1CCOc2cc(ccc12)S(=O)(=O)Nc1cccc(F)n1)C(F)(F)F