Reaction Details
TargetSodium channel protein type 9 subunit alpha
LigandBDBM371776
Substrate/Competitorn/a
Meas. Tech.Rubidium efflux assay
IC50 0.500±n/a nM
Citation Ramdas, VLoriya, RMBanerjee, MPatil, PRJoshi, AADatrange, LSWalke, DSKhan, THDas, AKGote, GNKalhapure, VMPalle, VPKamboj, RK Sulfonamide compounds as voltage-gated sodium channel modulators US Patent US10239869 Publication Date 3/26/2019
 
Sodium channel protein type 9 subunit alpha
Name:Sodium channel protein type 9 subunit alpha
Type:Protein
Mol. Mass.:226375.97
Organism:Homo sapiens (Human)
Description:Q15858
Residue:1988
BDBM371776
NameBDBM371776
Synonyms:(R)-4-(2-(6-methylpyridin-3-yl)-4-(trifluoromethyl)phenyl)-N-(pyrimidin-2-yl)chroman-7-sulfonamide | US10239869, Example 202
TypeSmall organic molecule
Emp. Form.C26H21F3N4O3S
Mol. Mass.526.53
SMILESCc1ccc(cn1)-c1cc(ccc1[C@H]1CCOc2cc(ccc12)S(=O)(=O)Nc1ncccn1)C(F)(F)F